-------------------------------------------------------
T E S T S
-------------------------------------------------------
There are no tests to run.
Results :
Tests run: 0, Failures: 0, Errors: 0, Skipped: 0
[INFO]
[INFO] --- maven-war-plugin:2.1.1:war (default-war) @ llemaicai ---
[INFO] Packaging webapp
[INFO] Assembling webapp [llemaicai] in [E:\dev\maicai\pro\llemaicai\target\llemaicai]
[INFO] Processing war project
[INFO] Copying webapp resources [E:\dev\maicai\pro\llemaicai\src\main\webapp]
[INFO] Webapp assembled in [35 msecs]
[INFO] Building war: E:\dev\maicai\pro\llemaicai\target\llemaicai.war
[WARNING] Warning: selected war files include a WEB-INF/web.xml which will be ignored
(webxml attribute is missing from war task, or ignoreWebxml attribute is specified as 'true')
[INFO]
[INFO] --- maven-install-plugin:2.3.1:install (default-install) @ llemaicai ---
[WARNING] The POM for org.codehaus.plexus:plexus-digest:jar:1.0 is invalid, transitive dependencies (if any) will not be available, enable debug logging for more details
2013-2-20 14:41:14 org.sonatype.guice.bean.reflect.LoadedClass
警告: Error injecting: org.apache.maven.plugin.install.InstallMojo
java.lang.NoClassDefFoundError: org/codehaus/plexus/digest/DigesterException
at java.lang.Class.getDeclaredConstructors0(Native Method)
at java.lang.Class.privateGetDeclaredConstructors(Class.java:2389)
at java.lang.Class.getDeclaredConstructors(Class.java:1836)
at com.google.inject.spi.InjectionPoint.forConstructorOf(InjectionPoint.java:243)
at com.google.inject.internal.ConstructorBindingImpl.create(ConstructorBindingImpl.java:96)
at com.google.inject.internal.InjectorImpl.createUninitializedBinding(InjectorImpl.java:628)
at com.google.inject.internal.InjectorImpl.createJustInTimeBinding(InjectorImpl.java:835)
at com.google.inject.internal.InjectorImpl.createJustInTimeBindingRecursive(InjectorImpl.java:769)
at com.google.inject.internal.InjectorImpl.getJustInTimeBinding(InjectorImpl.java:254)
at com.google.inject.internal.InjectorImpl.getBindingOrThrow(InjectorImpl.java:205)
at com.google.inject.internal.InjectorImpl.getInternalFactory(InjectorImpl.java:843)
at com.google.inject.internal.InjectorImpl.getProviderOrThrow(InjectorImpl.java:957)
at com.google.inject.internal.InjectorImpl.getProvider(InjectorImpl.java:990)
at com.google.inject.internal.InjectorImpl.getProvider(InjectorImpl.java:951)
at com.google.inject.internal.InjectorImpl.getInstance(InjectorImpl.java:1003)
at org.sonatype.guice.bean.reflect.AbstractDeferredClass.get(AbstractDeferredClass.java:47)
at com.google.inject.internal.InternalFactoryToProviderAdapter.get(InternalFactoryToProviderAdapter.java:40)
at com.google.inject.internal.InjectorImpl$4$1.call(InjectorImpl.java:968)
at com.google.inject.internal.InjectorImpl.callInContext(InjectorImpl.java:1014)
at com.google.inject.internal.InjectorImpl$4.get(InjectorImpl.java:964)
at com.google.inject.Scopes$1$1.get(Scopes.java:59)
at org.sonatype.guice.bean.locators.LazyBeanEntry.getValue(LazyBeanEntry.java:79)
at org.sonatype.guice.plexus.locators.LazyPlexusBean.getValue(LazyPlexusBean.java:53)
at org.codehaus.plexus.DefaultPlexusContainer.lookup(DefaultPlexusContainer.java:243)
at org.codehaus.plexus.DefaultPlexusContainer.lookup(DefaultPlexusContainer.java:235)
at org.apache.maven.plugin.internal.DefaultMavenPluginManager.getConfiguredMojo(DefaultMavenPluginManager.java:455)
at org.apache.maven.plugin.DefaultBuildPluginManager.executeMojo(DefaultBuildPluginManager.java:92)
at org.apache.maven.lifecycle.internal.MojoExecutor.execute(MojoExecutor.java:209)
at org.apache.maven.lifecycle.internal.MojoExecutor.execute(MojoExecutor.java:153)
at org.apache.maven.lifecycle.internal.MojoExecutor.execute(MojoExecutor.java:145)
at org.apache.maven.lifecycle.internal.LifecycleModuleBuilder.buildProject(LifecycleModuleBuilder.java:84)
at org.apache.maven.lifecycle.internal.LifecycleModuleBuilder.buildProject(LifecycleModuleBuilder.java:59)
at org.apache.maven.lifecycle.internal.LifecycleStarter.singleThreadedBuild(LifecycleStarter.java:183)
at org.apache.maven.lifecycle.internal.LifecycleStarter.execute(LifecycleStarter.java:161)
at org.apache.maven.DefaultMaven.doExecute(DefaultMaven.java:319)
at org.apache.maven.DefaultMaven.execute(DefaultMaven.java:156)
at org.apache.maven.cli.MavenCli.execute(MavenCli.java:537)
at org.apache.maven.cli.MavenCli.doMain(MavenCli.java:196)
at org.apache.maven.cli.MavenCli.main(MavenCli.java:141)
at sun.reflect.NativeMethodAccessorImpl.invoke0(Native Method)
at sun.reflect.NativeMethodAccessorImpl.invoke(NativeMethodAccessorImpl.java:39)
at sun.reflect.DelegatingMethodAccessorImpl.invoke(DelegatingMethodAccessorImpl.java:25)
at java.lang.reflect.Method.invoke(Method.java:597)
at org.codehaus.plexus.classworlds.launcher.Launcher.launchEnhanced(Launcher.java:290)
at org.codehaus.plexus.classworlds.launcher.Launcher.launch(Launcher.java:230)
at org.codehaus.plexus.classworlds.launcher.Launcher.mainWithExitCode(Launcher.java:409)
at org.codehaus.plexus.classworlds.launcher.Launcher.main(Launcher.java:352)
Caused by: java.lang.ClassNotFoundException: org.codehaus.plexus.digest.DigesterException
at org.codehaus.plexus.classworlds.strategy.SelfFirstStrategy.loadClass(SelfFirstStrategy.java:50)
at org.codehaus.plexus.classworlds.realm.ClassRealm.loadClass(ClassRealm.java:244)
at org.codehaus.plexus.classworlds.realm.ClassRealm.loadClass(ClassRealm.java:230)
... 47 more
[INFO] ------------------------------------------------------------------------
[INFO] BUILD FAILURE
[INFO] ------------------------------------------------------------------------
[INFO] Total time: 1.669s
[INFO] Finished at: Wed Feb 20 14:41:14 CST 2013
[INFO] Final Memory: 4M/15M
[INFO] ------------------------------------------------------------------------
[ERROR] Failed to execute goal org.apache.maven.plugins:maven-install-plugin:2.3.1:install (default-install) on project llemaicai: Execution default-install of goal org.apache.maven.plugins:maven-install-plugin:2.3.1:install failed: Unable to load the mojo 'install' in the plugin 'org.apache.maven.plugins:maven-install-plugin:2.3.1'. A required class is missing: org/codehaus/plexus/digest/DigesterException
[ERROR] -----------------------------------------------------
[ERROR] realm = plugin>org.apache.maven.plugins:maven-install-plugin:2.3.1
[ERROR] strategy = org.codehaus.plexus.classworlds.strategy.SelfFirstStrategy
[ERROR] urls[0] = file:/D:/javalib/repository/org/apache/maven/plugins/maven-install-plugin/2.3.1/maven-install-plugin-2.3.1.jar
[ERROR] urls[1] = file:/D:/javalib/repository/junit/junit/3.8.1/junit-3.8.1.jar
[ERROR] urls[2] = file:/D:/javalib/repository/org/codehaus/plexus/plexus-utils/2.0.5/plexus-utils-2.0.5.jar
[ERROR] urls[3] = file:/D:/javalib/repository/org/codehaus/plexus/plexus-digest/1.0/plexus-digest-1.0.jar
[ERROR] Number of foreign imports: 1
[ERROR] import: Entry[import from realm ClassRealm[maven.api, parent: null]]
[ERROR]
[ERROR] -----------------------------------------------------: org.codehaus.plexus.digest.DigesterException
[ERROR] -> [Help 1]
[ERROR]
[ERROR] To see the full stack trace of the errors, re-run Maven with the -e switch.
[ERROR] Re-run Maven using the -X switch to enable full debug logging.
[ERROR]
[ERROR] For more information about the errors and possible solutions, please read the following articles:
[ERROR] [Help 1] http://cwiki.apache.org/confluence/display/MAVEN/PluginContainerException
相关推荐
org.apache.maven.archiver.MavenArchiver.getManifest(org.apache.maven.project.MavenProject, org.apache.maven.archiver.MavenArchiveConfiguration) 解决方案: 第一种方式 war项目 <plugin> <groupId>org...
1) Error injecting constructor, java.lang.NoSuchMethodError: org.apache.maven.model.validation.DefaultModelValidator: method 'void ()' not found at org.jetbrains.idea.maven.server.embedder....
3. **commons-pool.jar**:Apache Commons Pool是对象池化的实现,DBCP使用这个库来管理数据库连接的生命周期,确保连接的有效利用和回收。 加载这些库到工程的方式因开发环境而异,以下是一些常见方法: - **IDE...
今天Maven在更新的时候发现一直更新不成功,总结下解决方法。 在apache-maven-3.5.2/conf/setting.xml中加入以下配置即可解决 alimaven aliyun maven ...
Failed to execute goal org.apache.maven.plugins:maven-clean-plugin:2.5:clean (default-clean) on project
idea创建Maven项目时,报错显示Failed to execute goal org.apache.maven.plugins:maven-resources-plugin:3.0.2:resources,并且Maven插件内看不到 mybatis-generator。如下图: 折腾了好久发现配置放错地方了,...
<groupId>org.apache.maven.plugins <artifactId>maven-shade-plugin <version>3.1.0 <phase>package <goal>shade implementation="org.apache.maven.plugins.shade.resource....
[ERROR] Failed to execute goal org.apache.maven.plugins:maven-plugin-plugin:3.2:descriptor (default -descriptor) on project maven-project: Error extracting plugin descriptor: ‘No mojo definitions wer...
在<plugins></plugins>中添加<plugin> <groupId>org.apache.maven.plugins <artifactId>maven-compiler-plugin <version>3.8.1 <source>1.8 <target>1.8 </plugin>
Minify Maven Plugin可以自动处理这些任务,它支持YUI Compressor和Google Closure Compiler等工具进行压缩,能有效减小文件体积,提升网站性能。 总结起来,这个压缩包包含了Apache ServiceMix中的Spring JDBC模块...
jar包分享,你懂的 com.springsource.org.apache.commons.io-1.4.0.jar
Maven 使用 tomcat8-maven-plugin 插件 Maven 是一个流行的构建自动化工具,它可以帮助开发者自动完成项目的编译、测试、打包、部署等任务。 Tomcat 是一个流行的 Web 服务器,Maven 提供了一个插件 tomcat8-maven-...
jar包,官方版本,自测可用
Failure to transfer org.codehaus.plexus:plexus-archiver:pom:1.0 from http://repo.maven.apache.org/maven2 was cached in the local repository, resolution will not be reattempted until the update ...
org.apache.maven.archiver.MavenArchiver.getManifest(org.apache.maven.project.MavenProject, org.apache.maven.archiver.MavenArchiveConfiguration) 网上更新eclipse插件的网址都失效了找了好久才有个离线版 ...
org.apache.commons.lang jar包
解决tomcat8-maven-plugin-3.0-r1655215.jar阿里云同有的问题。放到路径org\apache\tomcat\maven\tomcat8-maven-plugin\3.0-r1655215\就可以了
org.apache.commons.net.ftp.FTPClient包,不错,在实际项目和产品中使用过。
idea启动项目报错 java.lang.NegativeArraySizeException解决方法
org.apache.axis2.jar